2,5-Dimethoxy-4-methyl-β-phenethylamine-M (HO-), bisTFA

Kovats' RI, non-polar column, temperature ramp

Data compiled by: NIST Mass Spectrometry Data Center, William E. Wallace, director

Column type Capillary
Active phase HP-1
Column length (m) 12.
Carrier gas He
Substrate
Column diameter (mm) 0.2
Phase thickness (μm) 0.33
Tstart (C) 100.
Tend (C) 310.
Heat rate (K/min) 30.
Initial hold (min) 3.
Final hold (min) 8.
I 1950.
ReferenceTheobald and Maurer, 2006
Comment MSDC-RI

References

Theobald and Maurer, 2006
Theobald, D.S.; Maurer, H.H., Studies on the metabolism and toxicological detection of the designer drug 2,5-dimethoxy-4-methyl-β-phenethylamine (2C-D) in rat urine using gas chromatographic/mass spectrometric techniques, J. Mass Spectrom., 2006, 41, 11, 1509-1519, https://doi.org/10.1002/jms.1128 . [all data]