Octadeca-9,12-dienoic acid tetradecyl ester, Z

Normal alkane RI, non-polar column, temperature ramp

Data compiled by: NIST Mass Spectrometry Data Center, William E. Wallace, director

Column type Capillary
Active phase DB-1MS
Column length (m) 30.
Carrier gas H2
Substrate
Column diameter (mm) 0.252
Phase thickness (μm) 0.25
Tstart (C) 240.
Tend (C) 340.
Heat rate (K/min) 1.
Initial hold (min)
Final hold (min)
I 3315.74
ReferenceStransky, Zarevucka, et al., 2006
Comment MSDC-RI

References

Stransky, Zarevucka, et al., 2006
Stransky, K.; Zarevucka, M.; Valterova, I.; Wimmer, Z., Gas chromatographic retention data of wax esters, J. Chromatogr. A, 2006, 1128, 1-2, 208-219, https://doi.org/10.1016/j.chroma.2006.06.035 . [all data]