epi-5β-Stigmastanol (24β-ethyl-5β-cholestan-3α-ol), TMS

Normal alkane RI, non-polar column, temperature ramp

View large format table.

Column type Active phase I Reference Comment
CapillaryDB-5MS3206.Rogge, Medeiros, et al., 200630. m/0.25 mm/0.25 μm, He, 60. C @ 2. min, 6. K/min, 300. C @ 15. min

References

Rogge, Medeiros, et al., 2006
Rogge, W.F.; Medeiros, P.M.; Simoneit, B.R.T., Organic marker compounds for surface soil and fugitive dust from open lot dairies and cattle feedlots, Atmos. Environ., 2006, 40, 1, 27-49, https://doi.org/10.1016/j.atmosenv.2005.07.076 . [all data]