5β-Campestanol (24α-methyl-5β-cholestan-3β-ol), TMS

Normal alkane RI, non-polar column, temperature ramp

Data compiled by: NIST Mass Spectrometry Data Center, William E. Wallace, director

Column type Capillary
Active phase DB-5MS
Column length (m) 30.
Carrier gas He
Substrate
Column diameter (mm) 0.25
Phase thickness (μm) 0.25
Tstart (C) 60.
Tend (C) 300.
Heat rate (K/min) 6.
Initial hold (min) 2.
Final hold (min) 15.
I 3107.
ReferenceRogge, Medeiros, et al., 2006
Comment MSDC-RI

References

Rogge, Medeiros, et al., 2006
Rogge, W.F.; Medeiros, P.M.; Simoneit, B.R.T., Organic marker compounds for surface soil and fugitive dust from open lot dairies and cattle feedlots, Atmos. Environ., 2006, 40, 1, 27-49, https://doi.org/10.1016/j.atmosenv.2005.07.076 . [all data]