2-Ethyleicosanoic acid

Van Den Dool and Kratz RI, non-polar column, temperature ramp

View large format table.

Column type Active phase I Reference Comment
CapillarySPB-12377.Radulovic, Lazarevic, et al., 200630. m/0.25 mm/0.25 μm, He, 50. C @ 3. min, 5. K/min, 250. C @ 15. min

References

Radulovic, Lazarevic, et al., 2006
Radulovic, N.; Lazarevic, J.; Stojanovic, G.; Palic, R., Chemotaxonomically significant 2-ethyl substituted fatty acids from Stachys milanii Petrovic (Lamiaceae), Biochem. Syst. Ecol., 2006, 34, 4, 341-344, https://doi.org/10.1016/j.bse.2005.10.008 . [all data]