(E)-2-Methyl-2-nonenal

Van Den Dool and Kratz RI, non-polar column, temperature ramp

View large format table.

Column type Active phase I Reference Comment
CapillarySPB-11211.Naef and Jaquier, 200630. m/0.25 mm/1. μm, He, 60. C @ 5. min, 5. K/min; Tend: 250. C

Van Den Dool and Kratz RI, polar column, temperature ramp

View large format table.

Column type Active phase I Reference Comment
CapillarySupelcowax1547.Naef and Jaquier, 2006He, 50. C @ 5. min, 5. K/min; Column length: 30. m; Phase thickness: 0.25 μm; Tend: 240. C

Normal alkane RI, non-polar column, custom temperature program

View large format table.

Column type Active phase I Reference Comment
CapillaryDB-11218.Delort and Jaquier, 200960. m/0.25 mm/0.25 μm, Helium; Program: 50 0C (5 min) 3 0C/min -> 120 0C 5 0C/min -> 250 0C (3 min) 15 0C/min -> 300 0C (20 min)

References

Naef and Jaquier, 2006
Naef, R.; Jaquier, A., New aldehydes and related alcohols in fresh lemon peel extract (Citrus limon L.), Flavour Fragr. J., 2006, 21, 5, 768-771, https://doi.org/10.1002/ffj.1678 . [all data]

Delort and Jaquier, 2009
Delort, E.; Jaquier, A., Novel terpenyl esters from Australian finger lime (Citrus australasica) peel extract, Flav. Fragr. J., 2009, 24, 3, 123-132, https://doi.org/10.1002/ffj.1922 . [all data]