(E)-Trimenal

Normal alkane RI, non-polar column, temperature ramp

View large format table.

Column type Active phase I Reference Comment
CapillaryDB-51423.Morteza-Semnani, Saeedi, et al., 200630. m/0.25 mm/0.25 μm, He, 60. C @ 4. min, 4. K/min; Tend: 260. C

References

Morteza-Semnani, Saeedi, et al., 2006
Morteza-Semnani, K.; Saeedi, M.; Akbarsadeh, M.; Moshiri, K., The essential oil composition of Onosma microcarpum DC., Flavour Fragr. J., 2006, 21, 2, 314-316, https://doi.org/10.1002/ffj.1597 . [all data]