4(1,2,2-Trimethylpropyl)phenol, pentafluorobenzoyl ester

Van Den Dool and Kratz RI, non-polar column, custom temperature program

View large format table.

Column type Active phase I Reference Comment
CapillaryVF-5MS2006.1Mjøs, Meier, et al., 200650. m/0.25 mm/0.25 μm, He; Program: 60C(2min) => 30C/min => 100C => 1C/min =>
CapillaryVF-5MS2011.9Mjøs, Meier, et al., 200650. m/0.25 mm/0.25 μm, He; Program: 60C(2min) => 30C/min => 100C => 2C/min =>
CapillaryVF-5MS2018.7Mjøs, Meier, et al., 200650. m/0.25 mm/0.25 μm, He; Program: 60C(2min) => 30C/min => 100C => 4C/min =>

References

Mjøs, Meier, et al., 2006
Mjøs, S.A.; Meier, S.; Boitsov, S., Alkylphenol retention indices, J. Chromatogr. A, 2006, 1123, 1, 98-105, https://doi.org/10.1016/j.chroma.2006.05.002 . [all data]