4(1,1-Dimethylhexyl)phenol, pentafluorobenzoyl ester

Van Den Dool and Kratz RI, non-polar column, custom temperature program

Data compiled by: NIST Mass Spectrometry Data Center, William E. Wallace, director

Column type CapillaryCapillaryCapillary
Active phase VF-5MSVF-5MSVF-5MS
Column length (m) 50.50.50.
Carrier gas HeHeHe
Substrate
Column diameter (mm) 0.250.250.25
Phase thickness (μm) 0.250.250.25
Program 60C(2min) => 30C/min => 100C => 1C/min => 60C(2min) => 30C/min => 100C => 2C/min => 60C(2min) => 30C/min => 100C => 4C/min =>
I 2107.62114.22121.3
ReferenceMjøs, Meier, et al., 2006Mjøs, Meier, et al., 2006Mjøs, Meier, et al., 2006
Comment MSDC-RI MSDC-RI MSDC-RI

References

Mjøs, Meier, et al., 2006
Mjøs, S.A.; Meier, S.; Boitsov, S., Alkylphenol retention indices, J. Chromatogr. A, 2006, 1123, 1, 98-105, https://doi.org/10.1016/j.chroma.2006.05.002 . [all data]