Atracylenolid

Normal alkane RI, non-polar column, custom temperature program

Data compiled by: NIST Mass Spectrometry Data Center, William E. Wallace, director

Column type Capillary
Active phase HP-5MS
Column length (m) 30.
Carrier gas He
Substrate
Column diameter (mm) 0.25
Phase thickness (μm) 0.25
Program 40C(1min) => 8C/min => 160C => 12C/min => 300C(5min)
I 1723.
ReferenceLi, Deng, et al., 2006
Comment MSDC-RI

References

Li, Deng, et al., 2006
Li, N.; Deng, C.; Li, Y.; Ye, H.; Zhang, X., Gas chromatography-mass spectrometry following microwave distillation and headspace solid-phase microextraction for fast analysis of essential oil in dry traditional Chinese medicine, J. Chromatogr. A, 2006, 1133, 1-2, 29-34, https://doi.org/10.1016/j.chroma.2006.08.046 . [all data]