Cyperadiene

Normal alkane RI, non-polar column, temperature ramp

Data compiled by: NIST Mass Spectrometry Data Center, William E. Wallace, director

Column type Capillary
Active phase SPB-5
Column length (m) 60.
Carrier gas Nitrogen
Substrate
Column diameter (mm) 0.35
Phase thickness (μm) 0.25
Tstart (C) 60.
Tend (C) 230.
Heat rate (K/min) 4.
Initial hold (min)
Final hold (min) 40.
I 1379.
ReferenceGauvin-Bialecki and Marodon, 2009
Comment MSDC-RI

References

Gauvin-Bialecki and Marodon, 2009
Gauvin-Bialecki, A.; Marodon, C., Essential oil of Ayapana triplinervis from Reunion island: a good natural source of thymohydroquinone dimethyl ether, Biochem. Systematics Ecol., 2009, 36, 11, 853-858, https://doi.org/10.1016/j.bse.2008.09.006 . [all data]