Cyclofarnesa-5(14),8,10-triene

Van Den Dool and Kratz RI, non-polar column, temperature ramp

Data compiled by: NIST Mass Spectrometry Data Center, William E. Wallace, director

Column type Capillary
Active phase CP Sil 5 CB
Column length (m) 25.
Carrier gas H2
Substrate
Column diameter (mm) 0.25
Phase thickness (μm)
Tstart (C) 80.
Tend (C) 270.
Heat rate (K/min) 10.
Initial hold (min)
Final hold (min)
I 1441.
ReferenceZiegenbein, Hanssen, et al., 2006
Comment MSDC-RI

References

Ziegenbein, Hanssen, et al., 2006
Ziegenbein, F.C.; Hanssen, H.-P.; König, W.A., Secondary metabolites from Ganoderma lucidum and Spongiporus leucomallellus, Phytochemistry, 2006, 67, 2, 202-211, https://doi.org/10.1016/j.phytochem.2005.10.025 . [all data]