trans-5-butyl-4-methyldihydrofuran-2(3H)-thione

Normal alkane RI, non-polar column, temperature ramp

View large format table.

Column type Active phase I Reference Comment
CapillaryHP-11397.Filippi, Fernandez, et al., 200650. m/0.2 mm/0.33 μm, He, 5. K/min, 250. C @ 30. min; Tstart: 80. C

Normal alkane RI, polar column, temperature ramp

View large format table.

Column type Active phase I Reference Comment
CapillaryInnowax2070.Filippi, Fernandez, et al., 200650. m/0.2 mm/0.2 μm, He, 5. K/min, 250. C @ 30. min; Tstart: 80. C

References

Filippi, Fernandez, et al., 2006
Filippi, J.-J.; Fernandez, X.; Lizzani-Cuvelier, L.; Loiseau, A.-M., Syntheses and olfactory characteristics of flavouring and perfuming lactone thiono-analogues, Flavour Fragr. J., 2006, 21, 1, 175-184, https://doi.org/10.1002/ffj.1559 . [all data]