5-α-Pregnan-3-α,11-β-diol-20-one, MO-TMS

Kovats' RI, non-polar column, custom temperature program

View large format table.

Column type Active phase I Reference Comment
CapillaryZB-12921.Ebner, Corol, et al., 200630. m/0.25 mm/0.25 μm, He; Program: 70C(5min) => 20C/min => 220C(0.33min) => 5C/min => 315C (4min)

Normal alkane RI, non-polar column, custom temperature program

View large format table.

Column type Active phase I Reference Comment
CapillaryPolydimethyl siloxane2847.Vandenheuvel, 1975Program: not specified

References

Ebner, Corol, et al., 2006
Ebner, M.J.; Corol, D.I.; Havlíková, H.; Honour, J.W.; Fry, J.P., Identification of neuroactive steroids and their precursors and metabolites in adult male rat brain, Endocrinology, 2006, 147, 1, 179-190, https://doi.org/10.1210/en.2005-1065 . [all data]

Vandenheuvel, 1975
Vandenheuvel, F.A., Gas-liquid chromatographic studies of reactions and structural relationships of steroids, J. Chromatogr., 1975, 103, 1, 113-134, https://doi.org/10.1016/S0021-9673(00)83806-6 . [all data]