3-Isobutyryloxy-6-hydroxytropane

Kovats' RI, non-polar column, temperature ramp

Data compiled by: NIST Mass Spectrometry Data Center, William E. Wallace, director

Column type Capillary
Active phase HP-5MS
Column length (m) 30.
Carrier gas He
Substrate
Column diameter (mm) 0.25
Phase thickness (μm) 0.25
Tstart (C) 50.
Tend (C) 300.
Heat rate (K/min) 4.
Initial hold (min)
Final hold (min) 10.
I 1570.
ReferenceDoncheva, Berkov, et al., 2006
Comment MSDC-RI

References

Doncheva, Berkov, et al., 2006
Doncheva, T.; Berkov, S.; Philipov, S., Comparative study of the alkaloids in tribe Datureae and their chemosystematic significance, Biochem. Syst. Ecol., 2006, 34, 6, 478-488, https://doi.org/10.1016/j.bse.2006.01.008 . [all data]