3α-Hydroxy-6β-tigloyloxytropane

Van Den Dool and Kratz RI, non-polar column, temperature ramp

View large format table.

Column type Active phase I Reference Comment
CapillaryHP-5MS1891.Humam, Munoz, et al., 200730. m/0.25 mm/0.25 μm, 70. C @ 1. min, 5. K/min, 285. C @ 15. min

Van Den Dool and Kratz RI, non-polar column, custom temperature program

View large format table.

Column type Active phase I Reference Comment
CapillaryHP-5MS1894.Humam, Munoz, et al., 200730. m/0.25 mm/0.25 μm; Program: not specified

References

Humam, Munoz, et al., 2007
Humam, M.; Munoz, O.; Christen, P.; Hostettmann, K., Tropane alkaloids of the aerial part of Schizanthus tricolor, Nat. Prod. Commun., 2007, 2, 7, 743-747. [all data]