African-1-ene

Normal alkane RI, non-polar column, temperature ramp

View large format table.

Column type Active phase I Reference Comment
CapillaryHP-51333.Coronel, Cerda-Garcia-Rojas, et al., 200630. m/0.32 mm/0.25 μm, He, 3. K/min; Tstart: 60. C; Tend: 246. C

References

Coronel, Cerda-Garcia-Rojas, et al., 2006
Coronel, A. del.C.; Cerda-Garcia-Rojas, C.M.; Joseph-Nathan, P.; Catalán, C.A.N., Chemical composition, seasonal variation and a new sesquiterpene alcohol from the essential oil of Lippia integrifolia, Flavour Fragr. J., 2006, 21, 5, 839-847, https://doi.org/10.1002/ffj.1736 . [all data]