(Z)-6-Pentadecen-2-one

Normal alkane RI, non-polar column, temperature ramp

Data compiled by: NIST Mass Spectrometry Data Center, William E. Wallace, director

Column type Capillary
Active phase SPB-1
Column length (m) 30.
Carrier gas Helium
Substrate
Column diameter (mm) 0.20
Phase thickness (μm) 0.20
Tstart (C) 70.
Tend (C) 220.
Heat rate (K/min) 3.
Initial hold (min)
Final hold (min) 15.
I 1650.
ReferenceCavaleiro, Pinto, et al., 2006
Comment MSDC-RI

References

Cavaleiro, Pinto, et al., 2006
Cavaleiro, C.; Pinto, E.; Gonsales, M.J.; Salguero, L., Antifungal activity of Juniperus essential oils agains dermatophyte, Asrgillus and Candida strains, J. Appl. Microbiol., 2006, 100, 6, 1333-1338, https://doi.org/10.1111/j.1365-2672.2006.02862.x . [all data]