(23S)-Ethylcholest-5-en-3-β-ol

Normal alkane RI, non-polar column, custom temperature program

Data compiled by: NIST Mass Spectrometry Data Center, William E. Wallace, director

Column type Capillary
Active phase HP-5
Column length (m) 30.
Carrier gas He
Substrate
Column diameter (mm) 0.25
Phase thickness (μm) 0.25
Program 60C(5min) => 3C/min => 120C (2min) => 2C/min => 200C (2min) => 3C/min => 320C
I 2999.
ReferenceYasar, Üçüncü, et al., 2005
Comment MSDC-RI

References

Yasar, Üçüncü, et al., 2005
Yasar, A.; Üçüncü, O.; Güleç, C.; Inceer, H.; Ayaz, S.; Yayh, N., GC-MS analysis of chloroform extracts in flowers, stems, and roots of Tripleurospermum callosum, Pharm. Biol., 2005, 43, 2, 108-112, https://doi.org/10.1080/13880200590919384 . [all data]