22R-epi-17β(H),21β(H)-Hopanoic acid methyl ester

Kovats' RI, non-polar column, isothermal

Data compiled by: NIST Mass Spectrometry Data Center, William E. Wallace, director

Column type Capillary
Active phase CP Sil 5 CB
Column length (m) 60.
Carrier gas
Substrate
Column diameter (mm) 0.25
Phase thickness (μm) 0.25
Temperature (C) 300.
I 3554.
ReferenceYamamoto, Naraoka, et al., 2005
Comment MSDC-RI

References

Yamamoto, Naraoka, et al., 2005
Yamamoto, M.; Naraoka, H.; Ishiwatari, R.; Ogihara, S., Carbon isotope signatures of bacterial 28-norhopanoic acids in Miocene-Pliocene diatomaceous and phosphatic sediments, Chem. Geol., 2005, 218, 1-2, 117-133, https://doi.org/10.1016/j.chemgeo.2005.01.027 . [all data]