β-Isocyclolavandulyl acetate

Van Den Dool and Kratz RI, non-polar column, temperature ramp

View large format table.

Column type Active phase I Reference Comment
CapillaryBP-11283.Vellutini, Baldovini, et al., 200550. m/0.22 mm/0.25 μm, He, 2. K/min, 230. C @ 35. min; Tstart: 60. C

Van Den Dool and Kratz RI, polar column, temperature ramp

View large format table.

Column type Active phase I Reference Comment
CapillaryBP-201634.Vellutini, Baldovini, et al., 200550. m/0.22 mm/0.25 μm, He, 2. K/min, 230. C @ 35. min; Tstart: 60. C

References

Vellutini, Baldovini, et al., 2005
Vellutini, M.; Baldovini, N.; de Rocca Serra, D. Tomi; Casanova, J., β-Cyclolavandulyl and β-isocyclolavandulyl esters from Peucedanum paniculatum L., an endemic species to Corsica, Phytochemistry, 2005, 66, 16, 1956-1962, https://doi.org/10.1016/j.phytochem.2005.07.001 . [all data]