Phenethylamine, 2,5-dimethoxy-4-methylthio, N-acetyl

Kovats' RI, non-polar column, temperature ramp

Data compiled by: NIST Mass Spectrometry Data Center, William E. Wallace, director

Column type Capillary
Active phase HP-1
Column length (m) 12.
Carrier gas He
Substrate
Column diameter (mm) 0.20
Phase thickness (μm) 0.33
Tstart (C) 100.
Tend (C) 300.
Heat rate (K/min) 30.
Initial hold (min) 3.
Final hold (min) 8.
I 2230.
ReferenceTheobald, Fehn, et al., 2005
Comment MSDC-RI

References

Theobald, Fehn, et al., 2005
Theobald, D.S.; Fehn, S.; Maurer, H.H., New designer drug, 2,5-dimethoxy-4-propylthio-β-phenethylamine (2C-T-7): studies on its metabolism and toxicological detection in rat urine using gas chromatography/mass spectrometry, J. Mass Spectrom., 2005, 40, 1, 105-116, https://doi.org/10.1002/jms.784 . [all data]