Viscida-3,11(18),14-triene

Van Den Dool and Kratz RI, non-polar column, temperature ramp

View large format table.

Column type Active phase I Reference Comment
CapillaryCP Sil 5 CB1911.Tesso, König, et al., 20053. K/min; Column length: 25. m; Column diameter: 0.25 mm; Tstart: 50. C; Tend: 230. C

References

Tesso, König, et al., 2005
Tesso, H.; König, W.A.; Asakawa, Y., Composition of the essential oil of the liverwort Radula perrottetii of Japanese origin, Phytochemistry, 2005, 66, 8, 941-949, https://doi.org/10.1016/j.phytochem.2005.03.003 . [all data]