(E,E,E)-2,4,6-Nonatrienal

Van Den Dool and Kratz RI, non-polar column, custom temperature program

View large format table.

Column type Active phase I Reference Comment
CapillaryDB-51286.Schuh and Schieberle, 200530. m/0.32 mm/0.25 μm; Program: 40C(2min) => 6C/min => 150C => 20C/min => 230C

Normal alkane RI, polar column, custom temperature program

View large format table.

Column type Active phase I Reference Comment
CapillarySupelcowax 101896.Castioni and Kapetanidis, 199660. m/0.25 mm/0.25 μm, Helium; Program: 60 0C (10 min) 2 0C/min -> 80 0C 3 0C/min -> 100 0C 4 0C/min -> 220 0C (30 min)
CapillarySupelcowax 101907.Castioni and Kapetanidis, 199660. m/0.25 mm/0.25 μm, Helium; Program: not specified

References

Schuh and Schieberle, 2005
Schuh, C.; Schieberle, P., Characterization of ( E, E, Z)-2,4,6-Nonatrienal as a character impact aroma compound of oat flakes, J. Agric. Food Chem., 2005, 53, 22, 8699-8705, https://doi.org/10.1021/jf051601i . [all data]

Castioni and Kapetanidis, 1996
Castioni, P.; Kapetanidis, I., Volatile constituents from Brunfelsia grandiflora ssp. grandiflora: qualitative analysis by GC-MS, Scientia Pharmaceutica, 1996, 64, 83-91. [all data]