11,12-Dehydrooxosparteine

Normal alkane RI, non-polar column, temperature ramp

Data compiled by: NIST Mass Spectrometry Data Center, William E. Wallace, director

Column type Capillary
Active phase DB-5
Column length (m) 30.
Carrier gas He
Substrate
Column diameter (mm) 0.25
Phase thickness (μm)
Tstart (C) 180.
Tend (C) 300.
Heat rate (K/min) 5.
Initial hold (min) 2.
Final hold (min) 10.
I 2239.
ReferencePrzybylak, Ciesiolka, et al., 2005
Comment MSDC-RI

References

Przybylak, Ciesiolka, et al., 2005
Przybylak, J.K.; Ciesiolka, D.; Wysocka, W.; García-López, P.M.; Ruiz-López, M.A.; Wysocki, W.; Gulewicz, K., Alkaloid profiles of Mexican wild lupin and an effect of alkaloid preparation from Lupinus exaltatus seeds on growth and yield of paprika (Capsicum annuum L.), Ind. Crops Prod., 2005, 21, 1, 1-7, https://doi.org/10.1016/j.indcrop.2003.12.001 . [all data]