2-Chlorobicyclo[2.2.1]hept-5-ene-exo-2-carboxamide

Normal alkane RI, non-polar column, custom temperature program

View large format table.

Column type Active phase I Reference Comment
CapillarySPB-51354.Plettner, Mohle, et al., 200530. m/0.25 mm/0.25 μm; Program: 50C(5min) => 5C/min => 100C(4min) => 50C/min => 250C(20min)

References

Plettner, Mohle, et al., 2005
Plettner, E.; Mohle, A.; Mwangi, M.T.; Griscti, J.; Patrick, B.O.; Nair, R.; Batchelor, R.J.; Einstein, F., 2-Chlorobicyclo[2.2.1]hept-5-ene-2-carboxamide and 2-chlorobicyclo[2.2.1]heptane-2-carboxamide as precursors of bicyclo[2.2.1]hept-5-en-2-one and bicyclo[2.2.1]heptan-2-one: resolution, absolute configuration and hydrogen-bonding properties, Tetrahedron: Asymmetry, 2005, 16, 16, 2754-2763, https://doi.org/10.1016/j.tetasy.2005.07.016 . [all data]