Eudesma-2,4(15),11-triene

Normal alkane RI, non-polar column, temperature ramp

View large format table.

Column type Active phase I Reference Comment
CapillaryCP Sil 5 CB1497.Ogunwande, Olawore, et al., 200525. m/0.25 mm/0.15 μm, 3. K/min; Tstart: 50. C; Tend: 230. C

References

Ogunwande, Olawore, et al., 2005
Ogunwande, I.A.; Olawore, N.O.; Adeleke, K.A.; Ekundayo, O., Volatile constituents from the leaves of Eucalyptus cloeziana F. Muell and E. propinqua Deane Maiden from Nigeria, Flavour Fragr. J., 2005, 20, 6, 637-639, https://doi.org/10.1002/ffj.1516 . [all data]