butyl 2-methylbutyl phthalate

Normal alkane RI, non-polar column, temperature ramp

Data compiled by: NIST Mass Spectrometry Data Center, William E. Wallace, director

Column type Capillary
Active phase HP-5
Column length (m) 60.
Carrier gas He
Substrate
Column diameter (mm) 0.32
Phase thickness (μm) 0.25
Tstart (C) 30.
Tend (C) 260.
Heat rate (K/min) 2.
Initial hold (min) 2.
Final hold (min) 28.
I 2200.
ReferenceLeffingwell and Alford, 2005
Comment MSDC-RI

References

Leffingwell and Alford, 2005
Leffingwell, J.C.; Alford, E.D., Volatile constituents of Perique tobacco, Electron. J. Environ. Agric. Food Chem., 2005, 4, 2, 899-915. [all data]