LACTITOL 9TMS

Van Den Dool and Kratz RI, non-polar column, temperature ramp

Data compiled by: NIST Mass Spectrometry Data Center, William E. Wallace, director

Column type Capillary
Active phase DB-5MS
Column length (m) 10.
Carrier gas
Substrate
Column diameter (mm) 0.18
Phase thickness (μm) 0.18
Tstart (C) 70.
Tend (C) 320.
Heat rate (K/min) 40.
Initial hold (min) 2.
Final hold (min) 2.
I 2756.6
ReferenceJonsson, Johansson, et al., 2005
Comment MSDC-RI

References

Jonsson, Johansson, et al., 2005
Jonsson, P.; Johansson, A.I.; Gullberg, J.; Trygg, J.; Jiye, A.; Grung, B.; Marklund, S.; Sjöström, M.; Antti, H.; Moritz, T., High-throughput data analysis for detecting and identifying differences between samples in GC/MS-based metabolomic analyses, Anal. Chem., 2005, 77, 17, 5635-5642, https://doi.org/10.1021/ac050601e . [all data]