Minalobine O

Kovats' RI, non-polar column, temperature ramp

Data compiled by: NIST Mass Spectrometry Data Center, William E. Wallace, director

Column type Capillary
Active phase DB-1
Column length (m) 30.
Carrier gas He
Substrate
Column diameter (mm) 0.32
Phase thickness (μm)
Tstart (C) 70.
Tend (C) 300.
Heat rate (K/min) 6.
Initial hold (min)
Final hold (min)
I 2236.
ReferenceJenett-Siems, Ott, et al., 2005
Comment MSDC-RI

References

Jenett-Siems, Ott, et al., 2005
Jenett-Siems, K.; Ott, S.C.; Schimming, T.; Siems, K.; Müller, F.; Hilker, M.; Witte, L.; Hartmann, T.; Austin, D.F.; Eich, E., Ipangulines and minalobines, chemotaxonomic markers of the infrageneric Ipomoea taxon subgenus Quamoclit, section Mina, Phytochemistry, 2005, 66, 2, 223-231, https://doi.org/10.1016/j.phytochem.2004.11.019 . [all data]