Minalobine B

Kovats' RI, non-polar column, temperature ramp

View large format table.

Column type Active phase I Reference Comment
CapillaryDB-11705.Jenett-Siems, Ott, et al., 2005He, 6. K/min; Column length: 30. m; Column diameter: 0.32 mm; Tstart: 70. C; Tend: 300. C

References

Jenett-Siems, Ott, et al., 2005
Jenett-Siems, K.; Ott, S.C.; Schimming, T.; Siems, K.; Müller, F.; Hilker, M.; Witte, L.; Hartmann, T.; Austin, D.F.; Eich, E., Ipangulines and minalobines, chemotaxonomic markers of the infrageneric Ipomoea taxon subgenus Quamoclit, section Mina, Phytochemistry, 2005, 66, 2, 223-231, https://doi.org/10.1016/j.phytochem.2004.11.019 . [all data]