cis-7,8-epoxy-2-methyl-Z4-octadecene

Van Den Dool and Kratz RI, non-polar column, custom temperature program

View large format table.

Column type Active phase I Reference Comment
CapillaryDB-52019.Gries R., Khaskin G., et al., 2005Column length: 30. m; Column diameter: 0.25 mm; Program: not specified

References

Gries R., Khaskin G., et al., 2005
Gries R.; Khaskin G.; Schaefer P.; Hahn R.; Gotoh T.; Gries G., (7R,8S)-cis-7,8-epoxy-2-methyloctadec-17-ene: A novel trace component from the sex pheromone gland of gypsy moth, Lymantria dispar, J. Chem. Ecol., 2005, 31, 1, 49-62, https://doi.org/10.1007/s10886-005-0973-5 . [all data]