Naphthalene-2-carboxylic acid, 3-hydroxy, DTBS

Kovats' RI, non-polar column, custom temperature program

View large format table.

Column type Active phase I Reference Comment
PackedOV-12280.Brooks and Cole, 1988N2, Gas-Chrom Q (100-120 mesh); Column length: 1.8 m; Program: not specified

References

Brooks and Cole, 1988
Brooks, C.J.W.; Cole, W.J., Cyclic Di-tert.-butylsilylene derivatives of substituted salicylic acids and related compounds. A study by gas chromatography-mass spectrometry, J. Chromatogr., 1988, 441, 1, 13-29, https://doi.org/10.1016/S0021-9673(01)84651-3 . [all data]