ethyl [4,4,6,6,6-2H5]-5-benzyloxy-3-hydroxy-3-methylpentanoate

Normal alkane RI, non-polar column, custom temperature program

View large format table.

Column type Active phase I Reference Comment
CapillaryBPX-51915.Dickschat J.S., Bode H.B., et al., 200525. m/0.22 mm/0.25 μm, He; Program: not specified

References

Dickschat J.S., Bode H.B., et al., 2005
Dickschat J.S.; Bode H.B.; Mahmud T.; Muller R.; Schulz S., A novel type of geosmin biosynthesis in myxobacteria, J. Org. Chem., 2005, 70, 13, 5174-5182, https://doi.org/10.1021/jo050449g . [all data]