[1,1,1-2H3]-4-Benzyloxy-2-butanol

Normal alkane RI, non-polar column, custom temperature program

Data compiled by: NIST Mass Spectrometry Data Center, William E. Wallace, director

Column type Capillary
Active phase BPX-5
Column length (m) 25.
Carrier gas He
Substrate
Column diameter (mm) 0.22
Phase thickness (μm) 0.25
Program not specified
I 1466.
ReferenceDickschat J.S., Bode H.B., et al., 2005
Comment MSDC-RI

References

Dickschat J.S., Bode H.B., et al., 2005
Dickschat J.S.; Bode H.B.; Mahmud T.; Muller R.; Schulz S., A novel type of geosmin biosynthesis in myxobacteria, J. Org. Chem., 2005, 70, 13, 5174-5182, https://doi.org/10.1021/jo050449g . [all data]