Benzoic acid, 2-hydroxy-3-(2-propenyl), DTBS

Kovats' RI, non-polar column, custom temperature program

Data compiled by: NIST Mass Spectrometry Data Center, William E. Wallace, director

Column type Packed
Active phase OV-1
Column length (m) 1.8
Carrier gas N2
Substrate Gas-Chrom Q (100-120 mesh)
Column diameter (mm)
Phase thickness (μm)
Program not specified
I 1950.
ReferenceBrooks and Cole, 1988
Comment MSDC-RI

References

Brooks and Cole, 1988
Brooks, C.J.W.; Cole, W.J., Cyclic Di-tert.-butylsilylene derivatives of substituted salicylic acids and related compounds. A study by gas chromatography-mass spectrometry, J. Chromatogr., 1988, 441, 1, 13-29, https://doi.org/10.1016/S0021-9673(01)84651-3 . [all data]