1,3-Cyclopentadiene, 2-butyl

Kovats' RI, non-polar column, isothermal

Data compiled by: NIST Mass Spectrometry Data Center, William E. Wallace, director

Column type Capillary
Active phase Squalane
Column length (m) 50.
Carrier gas H2
Substrate
Column diameter (mm) 0.25
Phase thickness (μm) 0.25
Temperature (C) 64.
I 913.
ReferenceSojak, Ruman, et al., 1987
Comment MSDC-RI

References

Sojak, Ruman, et al., 1987
Sojak, L.; Ruman, J.; Janak, J., Characterization of Monoalkylcyclopentadiens by Retention-Structure Correlation in Capillary Gas Chromatography, J. Chromatogr., 1987, 391, 79-87, https://doi.org/10.1016/S0021-9673(01)94306-7 . [all data]