5,5-Dimethyl-2,4-heptanedione

Kovats' RI, non-polar column, isothermal

View large format table.

Column type Active phase Temperature (C) I Reference Comment
CapillaryDB-5130.988.41Mijin and Antonovic, 200460. m/0.321 mm/0.25 μm, N2
CapillaryDB-5150.993.79Mijin and Antonovic, 200460. m/0.321 mm/0.25 μm, N2

References

Mijin and Antonovic, 2004
Mijin, D.Z.; Antonovic, D.G., Temperature dependence of the Kovats retention indices for alkyl 1,3-diketones on a DB-5 capillary column, J. Serb. Chem. Soc., 2004, 69, 10, 759-767, https://doi.org/10.2298/JSC0410759M . [all data]