Heptatriaconta-15E,22E-dien-2-one

Van Den Dool and Kratz RI, non-polar column, custom temperature program

View large format table.

Column type Active phase I Reference Comment
CapillaryDB-53892.Lopez, de Oteyza, et al., 200530. m/0.25 mm/0.25 μm, H2; Program: 70C(1min) => 10C/min => 140C => 4C/min => 310C(30min)
CapillaryHP-53892.López and Grimalt, 200430. m/0.25 mm/0.25 μm; Program: 90C(1min) => 15C/min => 150C => 4C/min => 310C(30min)

References

Lopez, de Oteyza, et al., 2005
Lopez, J.F.; de Oteyza, T.G.; Teixidor, P.; Grimalt, J.O., Long chain alkenones in hypersaline and marine coastal microbial mats, Org. Geochem., 2005, 36, 6, 861-872, https://doi.org/10.1016/j.orggeochem.2005.01.008 . [all data]

López and Grimalt, 2004
López, J.F.; Grimalt, J.O., Phenyl- and Cyclopentylimino Derivatization for Double Bond Location in Unsaturated C37-C40 Alkenones by GC-MS, J. Am. Soc. Mass Spectrom., 2004, 15, 8, 1161-1172, https://doi.org/10.1016/j.jasms.2004.04.024 . [all data]