2-methylene-6,6-dimethylcyclohex-3-ene-1-carboxaldehyde

Normal alkane RI, non-polar column, custom temperature program

View large format table.

Column type Active phase I Reference Comment
CapillaryHP-5MS1004.Kanakis, Daferera, et al., 200430. m/0.25 mm/0.25 μm, He; Program: 50C(3min) => 3C/min) => 180C => 15C/min => 250C(5min)

References

Kanakis, Daferera, et al., 2004
Kanakis, C.D.; Daferera, D.J.; Tarantilis, P.A.; Polissiou, M.G., Qualitative determination of volatile compounds and quantitative evaluation of safranal and 4-hydroxy-2,6,6-trimethyl-1-cyclohexene-1-carboxaldehyde (HTCC) in Greek saffron, J. Agric. Food Chem., 2004, 52, 14, 4515-4521, https://doi.org/10.1021/jf049808j . [all data]