1-O-(24-lithocholyl)-β-D-galactopyranose, TFA

Normal alkane RI, non-polar column, custom temperature program

View large format table.

Column type Active phase I Reference Comment
CapillaryBPX-53429.Iida, Ogawa, et al., 200410. m/0.1 mm/0.1 μm, He; Program: isothermal, 265C, or 240C => 1C/min => 255C => 3C/min => 280C

References

Iida, Ogawa, et al., 2004
Iida, T.; Ogawa, S.; Kakiyama, G.; Goto, T.; Mano, N.; Goto, J.; Nambara, T., Capillary gas chromatographic separation of bile acid acyl glycosides without thermal decomposition and isomerization, J. Chromatogr. A, 2004, 1057, 1-2, 171-176, https://doi.org/10.1016/j.chroma.2004.09.029 . [all data]