1-O-(24-chenodeoxycholyl)-β-D-galactopyranose, TFA

Normal alkane RI, non-polar column, custom temperature program

Data compiled by: NIST Mass Spectrometry Data Center, William E. Wallace, director

Column type Capillary
Active phase BPX-5
Column length (m) 10.
Carrier gas He
Substrate
Column diameter (mm) 0.1
Phase thickness (μm) 0.1
Program isothermal, 265C, or 240C => 1C/min => 255C => 3C/min => 280C
I 3398.
ReferenceIida, Ogawa, et al., 2004
Comment MSDC-RI

References

Iida, Ogawa, et al., 2004
Iida, T.; Ogawa, S.; Kakiyama, G.; Goto, T.; Mano, N.; Goto, J.; Nambara, T., Capillary gas chromatographic separation of bile acid acyl glycosides without thermal decomposition and isomerization, J. Chromatogr. A, 2004, 1057, 1-2, 171-176, https://doi.org/10.1016/j.chroma.2004.09.029 . [all data]