(+)-(1R*,4S*,5S*,7S*,10S*)-viticulol

Van Den Dool and Kratz RI, non-polar column, custom temperature program

View large format table.

Column type Active phase I Reference Comment
CapillaryCP Sil 5 CB2102.Hackl, König, et al., 2004Column length: 25. m; Program: not specified

References

Hackl, König, et al., 2004
Hackl, T.; König, W.A.; Muhle, H., Isogermacrene A, a proposed intermediate in sesquiterpene biosynthesis, Phytochemistry, 2004, 65, 15, 2261-2275, https://doi.org/10.1016/j.phytochem.2004.05.024 . [all data]