(Z,E)-11,13,15-hexadecatrienyl acetate

Van Den Dool and Kratz RI, non-polar column, temperature ramp

View large format table.

Column type Active phase I Reference Comment
CapillaryDB-52088.Gries, Reckziegel, et al., 20044. K/min; Column length: 30. m; Column diameter: 0.25 mm; Tstart: 60. C; Tend: 300. C

References

Gries, Reckziegel, et al., 2004
Gries, R.; Reckziegel, A.; Bogenschütz, H.; Kontzog, H.-G.; Schlegel, C.; Francke, W.; Millar, J.G.; Gries, G., (Z,Z)-11,13-Hexadecadienyl acetate and (Z,E)-11,13,15-hexadecatrienyl acetate: synergistic sex pheromone components of oak processionary moth, Thaumetopoea processionea (Lepidoptera: Thaumetopoeidae), Chemoecology, 2004, 14, 2, 95-100, https://doi.org/10.1007/s00049-003-0266-9 . [all data]