4,14-dimethyl,24-ethyl-cholestane

Normal alkane RI, non-polar column, temperature ramp

View large format table.

Column type Active phase I Reference Comment
CapillaryDB-53232.Fincka, Aydin, et al., 200430. m/0.25 mm/0.25 μm, He, 80. C @ 1. min, 4. K/min, 300. C @ 30. min

References

Fincka, Aydin, et al., 2004
Fincka, Y.; Aydin, N.; Pellaton, C.; Gorin, G.; Gulacar, F., Combination of gas chromatography-mass spectrometry and mass spectral deconvolution for structural elucidation of an unusual C29-steroid detected in a complex sedimentary matrix, J. Chromatogr. A, 2004, 1049, 1-2, 227-231, https://doi.org/10.1016/j.chroma.2004.08.004 . [all data]