(S)-9-methyldecan-3-ol

Van Den Dool and Kratz RI, non-polar column, temperature ramp

View large format table.

Column type Active phase I Reference Comment
CapillaryBPX-51273.Dickschat, Wenzel, et al., 200425. m/0.22 mm/0.25 μm, He, 50. C @ 5. min, 5. K/min; Tend: 300. C

References

Dickschat, Wenzel, et al., 2004
Dickschat, J.S.; Wenzel, S.C.; Bode, H.B.; Muller, R.; Schulz, S., Biosynthesis of Volatiles by the Myxobacterium Myxococcus xanthus, ChemBioChem, 2004, 5, 6, 778-787, https://doi.org/10.1002/cbic.200300813 . [all data]