Acetylsenecivernine

Normal alkane RI, non-polar column, custom temperature program

View large format table.

Column type Active phase I Reference Comment
CapillaryDB-12450.Asres, Sporer, et al., 2004He; Column length: 30. m; Column diameter: 0.3 mm; Program: 120C => (6C/min or 1.5C/min) => 300C

References

Asres, Sporer, et al., 2004
Asres, K.; Sporer, F.; Wink, M., Patterns of pyrrolizidine alkaloids in 12 Ethiopian Crotalaria species, Biochem. Syst. Ecol., 2004, 32, 10, 915-930, https://doi.org/10.1016/j.bse.2004.03.004 . [all data]