9-Hydroxyisohexenoylretronecine

Normal alkane RI, non-polar column, custom temperature program

Data compiled by: NIST Mass Spectrometry Data Center, William E. Wallace, director

Column type Capillary
Active phase DB-1
Column length (m) 30.
Carrier gas He
Substrate
Column diameter (mm) 0.3
Phase thickness (μm)
Program 120C => (6C/min or 1.5C/min) => 300C
I 2041.
ReferenceAsres, Sporer, et al., 2004
Comment MSDC-RI

References

Asres, Sporer, et al., 2004
Asres, K.; Sporer, F.; Wink, M., Patterns of pyrrolizidine alkaloids in 12 Ethiopian Crotalaria species, Biochem. Syst. Ecol., 2004, 32, 10, 915-930, https://doi.org/10.1016/j.bse.2004.03.004 . [all data]