2α,9-dihydroxy-1,8-cineole

Normal alkane RI, polar column, temperature ramp

Data compiled by: NIST Mass Spectrometry Data Center, William E. Wallace, director

Column type Capillary
Active phase DB-Wax Etr
Column length (m) 60.
Carrier gas H2
Substrate
Column diameter (mm) 0.25
Phase thickness (μm) 0.25
Tstart (C) 50.
Tend (C) 240.
Heat rate (K/min) 6.
Initial hold (min) 1.
Final hold (min)
I 2801.
ReferenceSouthwell, Russell, et al., 2003
Comment MSDC-RI

References

Southwell, Russell, et al., 2003
Southwell, I.A.; Russell, M.F.; Maddox, C.D.A.; Wheeler, G.S., Differential metabolism of 1,8-cineole in insects, J. Chem. Ecol., 2003, 29, 1, 83-94, https://doi.org/10.1023/A:1021976513603 . [all data]