2-[Isopropylthio]ethanal

Normal alkane RI, polar column, temperature ramp

Data compiled by: NIST Mass Spectrometry Data Center, William E. Wallace, director

Column type Capillary
Active phase HP-Innowax
Column length (m) 30.
Carrier gas N2
Substrate
Column diameter (mm) 0.25
Phase thickness (μm) 0.25
Tstart (C) 60.
Tend (C) 220.
Heat rate (K/min) 5.
Initial hold (min)
Final hold (min)
I 1391.
ReferenceRossner, Kubec, et al., 2002
Comment MSDC-RI

References

Rossner, Kubec, et al., 2002
Rossner, J.; Kubec, R.; Velisek, J.; Davidek, J., Formation of aldehydes from S-alk(en)ylcysteines and their sulfoxides, Eur. Food Res. Technol., 2002, 215, 2, 124-130, https://doi.org/10.1007/s00217-002-0524-z . [all data]